Target
Serine/threonine-protein kinase mTOR
Ligand
BDBM50328611
Substrate
Meas. Tech.
ChEMBL_665720 (CHEMBL1261689)
IC50
52±n/a nM
Citation
 Liu, QChang, JWWang, JKang, SAThoreen, CCMarkhard, AHur, WZhang, JSim, TSabatini, DMGray, NS Discovery of 1-(4-(4-propionylpiperazin-1-yl)-3-(trifluoromethyl)phenyl)-9-(quinolin-3-yl)benzo[h][1,6]naphthyridin-2(1H)-one as a highly potent, selective mammalian target of rapamycin (mTOR) inhibitor for the treatment of cancer. J Med Chem 53:7146-55 (2010)  
Target
Name:
Serine/threonine-protein kinase mTOR
Synonyms:
FK506-binding protein 12-rapamycin complex-associated protein 1 FRAP FRAP1 MTOR Mammalian Target of Rapamycin (mTOR) RAFT1 Rapamycin and FKBP12 target 1 Serine/threonine-protein kinase (mTOR) | mTORC2
Type:
Rapamycin target protein
Mol. Mass.:
288917.12
Organism:
Homo sapiens (Human)
Description:
P42345
Residue:
2549
  
Inhibitor
Name:
BDBM50328611
Synonyms:
4-methyl-1-(4-(4-propionylpiperazin-1-yl)-3-(trifluoromethyl)phenyl)-9-(quinolin-3-yl)benzo[h][1,6]naphthyridin-2(1H)-one | CHEMBL1256464
Type:
Small organic molecule
Emp. Form.:
C36H30F3N5O2
Mol. Mass.:
621.6509
SMILES:
CCC(=O)N1CCN(CC1)c1ccc(cc1C(F)(F)F)-n1c2c(cnc3ccc(cc23)-c2cnc3ccccc3c2)c(C)cc1=O
: