Target
Serine/threonine-protein kinase mTOR
Ligand
BDBM50328596
Substrate
Meas. Tech.
ChEMBL_665716 (CHEMBL1261685)
IC50
40±n/a nM
Citation
 Liu, QChang, JWWang, JKang, SAThoreen, CCMarkhard, AHur, WZhang, JSim, TSabatini, DMGray, NS Discovery of 1-(4-(4-propionylpiperazin-1-yl)-3-(trifluoromethyl)phenyl)-9-(quinolin-3-yl)benzo[h][1,6]naphthyridin-2(1H)-one as a highly potent, selective mammalian target of rapamycin (mTOR) inhibitor for the treatment of cancer. J Med Chem 53:7146-55 (2010)  
Target
Name:
Serine/threonine-protein kinase mTOR
Synonyms:
FK506-binding protein 12-rapamycin complex-associated protein 1 Frap MTOR_MOUSE Mechanistic target of rapamycin RAPT1 Serine/threonine-protein kinase mTOR | Serine/threonine-protein kinase mTOR (mTOR)
Type:
Enzyme
Mol. Mass.:
288814.44
Organism:
Mus musculus (Mouse)
Description:
Q9JLN9
Residue:
2549
  
Inhibitor
Name:
BDBM50328596
Synonyms:
9-(benzo[d][1,3]dioxol-5-yl)-1-(4-(piperazin-1-yl)-3-(trifluoromethyl)phenyl)benzo[h][1,6]naphthyridin-2(1H)-one | CHEMBL1259070
Type:
Small organic molecule
Emp. Form.:
C30H23F3N4O3
Mol. Mass.:
544.5238
SMILES:
FC(F)(F)c1cc(ccc1N1CCNCC1)-n1c2c(ccc1=O)cnc1ccc(cc21)-c1ccc2OCOc2c1
: