Target
Serine/threonine-protein kinase mTOR
Ligand
BDBM50328608
Substrate
Meas. Tech.
ChEMBL_665716 (CHEMBL1261685)
IC50
30±n/a nM
Citation
 Liu, QChang, JWWang, JKang, SAThoreen, CCMarkhard, AHur, WZhang, JSim, TSabatini, DMGray, NS Discovery of 1-(4-(4-propionylpiperazin-1-yl)-3-(trifluoromethyl)phenyl)-9-(quinolin-3-yl)benzo[h][1,6]naphthyridin-2(1H)-one as a highly potent, selective mammalian target of rapamycin (mTOR) inhibitor for the treatment of cancer. J Med Chem 53:7146-55 (2010)  
Target
Name:
Serine/threonine-protein kinase mTOR
Synonyms:
FK506-binding protein 12-rapamycin complex-associated protein 1 Frap MTOR_MOUSE Mechanistic target of rapamycin RAPT1 Serine/threonine-protein kinase mTOR | Serine/threonine-protein kinase mTOR (mTOR)
Type:
Enzyme
Mol. Mass.:
288814.44
Organism:
Mus musculus (Mouse)
Description:
Q9JLN9
Residue:
2549
  
Inhibitor
Name:
BDBM50328608
Synonyms:
1-(4-(1-propionyl-1,2,3,6-tetrahydropyridin-4-yl)-3-(trifluoromethyl)phenyl)-9-(quinolin-3-yl)benzo[h][1,6]naphthyridin-2(1H)-one | CHEMBL1256461
Type:
Small organic molecule
Emp. Form.:
C36H27F3N4O2
Mol. Mass.:
604.6204
SMILES:
CCC(=O)N1CCC(=CC1)c1ccc(cc1C(F)(F)F)-n1c2c(ccc1=O)cnc1ccc(cc21)-c1cnc2ccccc2c1
: