Target
Serine/threonine-protein kinase mTOR
Ligand
BDBM50328614
Substrate
Meas. Tech.
ChEMBL_665716 (CHEMBL1261685)
IC50
100±n/a nM
Citation
 Liu, QChang, JWWang, JKang, SAThoreen, CCMarkhard, AHur, WZhang, JSim, TSabatini, DMGray, NS Discovery of 1-(4-(4-propionylpiperazin-1-yl)-3-(trifluoromethyl)phenyl)-9-(quinolin-3-yl)benzo[h][1,6]naphthyridin-2(1H)-one as a highly potent, selective mammalian target of rapamycin (mTOR) inhibitor for the treatment of cancer. J Med Chem 53:7146-55 (2010)  
Target
Name:
Serine/threonine-protein kinase mTOR
Synonyms:
FK506-binding protein 12-rapamycin complex-associated protein 1 Frap MTOR_MOUSE Mechanistic target of rapamycin RAPT1 Serine/threonine-protein kinase mTOR | Serine/threonine-protein kinase mTOR (mTOR)
Type:
Enzyme
Mol. Mass.:
288814.44
Organism:
Mus musculus (Mouse)
Description:
Q9JLN9
Residue:
2549
  
Inhibitor
Name:
BDBM50328614
Synonyms:
3-methyl-1-(4-(4-propionylpiperazin-1-yl)-3-(trifluoromethyl)phenyl)-9-(quinolin-3-yl)-3,4-dihydropyrimido[5,4-c]quinolin-2(1H)-one | CHEMBL1256467
Type:
Small organic molecule
Emp. Form.:
C35H31F3N6O2
Mol. Mass.:
624.6548
SMILES:
CCC(=O)N1CCN(CC1)c1ccc(cc1C(F)(F)F)N1C(=O)N(C)Cc2cnc3ccc(cc3c12)-c1cnc2ccccc2c1
: