Target
Beta-secretase 1
Ligand
BDBM50302841
Substrate
Meas. Tech.
ChEMBL_673655 (CHEMBL1274832)
IC50
47±n/a nM
Citation
 Truong, APTóth, GProbst, GDSealy, JMBowers, SWone, DWDressen, DHom, RKKonradi, AWSham, HLWu, JPeterson, BTRuslim, LBova, MPKholodenko, DMotter, RNBard, FSantiago, PNi, HChian, DSoriano, FCole, TBrigham, EFWong, KZmolek, WGoldbach, ESamant, BChen, LZhang, HNakamura, DFQuinn, KPYednock, TASauer, JM Design of an orally efficacious hydroxyethylamine (HEA) BACE-1 inhibitor in a preclinical animal model. Bioorg Med Chem Lett 20:6231-6 (2010)  
Target
Name:
Beta-secretase 1
Synonyms:
ASP2 Aspartyl protease 2 BACE1 Beta-secretase (BACE) Beta-secretase 1 (BACE 1) Beta-secretase 1 (BACE1) Beta-site amyloid precursor protein cleaving enzyme 1 Memapsin-2 beta-Secretase (BACE-1) | beta-Secretase (BACE1)
Type:
Protein
Mol. Mass.:
55755.10
Organism:
Homo sapiens (Human)
Description:
P56817
Residue:
501
  
Inhibitor
Name:
BDBM50302841
Synonyms:
CHEMBL571860 N-[(1S,2R)-3-{[1-(3-tert-butylphenyl)cyclohexyl]amino}-1-(3,5-difluorobenzyl)-2-hydroxypropyl]acetamide
Type:
Small organic molecule
Emp. Form.:
C28H38F2N2O2
Mol. Mass.:
472.6103
SMILES:
CC(=O)N[C@@H](Cc1cc(F)cc(F)c1)[C@H](O)CNC1(CCCCC1)c1cccc(c1)C(C)(C)C
: