Target
Mu-type opioid receptor
Ligand
BDBM50294428
Substrate
Meas. Tech.
ChEMBL_674207 (CHEMBL1274304)
Ki
10.8±n/a nM
Citation
 Nagase, HNemoto, TMatsubara, ASaito, MYamamoto, NOsa, YHirayama, SNakajima, MNakao, KMochizuki, HFujii, H Design and synthesis of KNT-127, ad-opioid receptor agonist effective by systemic administration. Bioorg Med Chem Lett 20:6302-5 (2010)  
Target
Name:
Mu-type opioid receptor
Synonyms:
M-OR-1 Mor OPRM_MOUSE Oprm | Oprm1
Type:
Enzyme Catalytic Domain
Mol. Mass.:
44431.62
Organism:
MOUSE
Description:
OPIATE Mu OPRM1 MOUSE::P42866
Residue:
398
  
Inhibitor
Name:
BDBM50294428
Synonyms:
CHEMBL552308 | SN-28
Type:
Small organic molecule
Emp. Form.:
C24H24N2O
Mol. Mass.:
356.4602
SMILES:
CN1CC[C@]23Cc4nc5ccccc5cc4C[C@H]2[C@H]1Cc1ccc(O)cc31
: