Target
Delta-type opioid receptor
Ligand
BDBM50294428
Substrate
Meas. Tech.
ChEMBL_674208 (CHEMBL1274305)
Ki
0.14±n/a nM
Citation
 Nagase, HNemoto, TMatsubara, ASaito, MYamamoto, NOsa, YHirayama, SNakajima, MNakao, KMochizuki, HFujii, H Design and synthesis of KNT-127, ad-opioid receptor agonist effective by systemic administration. Bioorg Med Chem Lett 20:6302-5 (2010)  
Target
Name:
Delta-type opioid receptor
Synonyms:
DOR-1 MSL-2 OPRD_MOUSE Oprd1
Type:
Enzyme Catalytic Domain
Mol. Mass.:
40577.25
Organism:
MOUSE
Description:
P32300
Residue:
372
  
Inhibitor
Name:
BDBM50294428
Synonyms:
CHEMBL552308 | SN-28
Type:
Small organic molecule
Emp. Form.:
C24H24N2O
Mol. Mass.:
356.4602
SMILES:
CN1CC[C@]23Cc4nc5ccccc5cc4C[C@H]2[C@H]1Cc1ccc(O)cc31
: