Target
Delta-type opioid receptor
Ligand
BDBM50329100
Substrate
Meas. Tech.
ChEMBL_674208 (CHEMBL1274305)
Ki
0.14±n/a nM
Citation
 Nagase, HNemoto, TMatsubara, ASaito, MYamamoto, NOsa, YHirayama, SNakajima, MNakao, KMochizuki, HFujii, H Design and synthesis of KNT-127, ad-opioid receptor agonist effective by systemic administration. Bioorg Med Chem Lett 20:6302-5 (2010)  
Target
Name:
Delta-type opioid receptor
Synonyms:
DOR-1 MSL-2 OPRD_MOUSE Oprd1
Type:
Enzyme Catalytic Domain
Mol. Mass.:
40577.25
Organism:
MOUSE
Description:
P32300
Residue:
372
  
Inhibitor
Name:
BDBM50329100
Synonyms:
CHEMBL1270475
Type:
Small organic molecule
Emp. Form.:
C27H28N2O2
Mol. Mass.:
412.5234
SMILES:
Oc1ccc2C[C@H]3N(CC4CC4)CC[C@@]4(Cc5nc6ccccc6cc5C[C@@]34O)c2c1
: