Target
Cytochrome P450 2C9
Ligand
BDBM50329311
Substrate
Meas. Tech.
ChEMBL_675408 (CHEMBL1273488)
IC50
4100±n/a nM
Citation
 Tice, CMZhao, WKrosky, PMKruk, BABerbaum, JJohnson, JABukhtiyarov, YPanemangalore, RScott, BBZhao, YBruno, JGHoward, LTogias, JYe, YJSingh, SBMcKeever, BMLindblom, PRGuo, JGuo, RNar, HSchuler-Metz, AGregg, RELeftheris, KHarrison, RKMcGeehan, GMZhuang, LClaremon, DA Discovery and optimization of adamantyl carbamate inhibitors of 11ß-HSD1. Bioorg Med Chem Lett 20:6725-9 (2010)  
Target
Name:
Cytochrome P450 2C9
Synonyms:
(R)-limonene 6-monooxygenase CP2C9_HUMAN CYP2C9 Cytochrome P450 2C9 (CYP2C9 ) P-450MP P450 PB-1 | S-mephenytoin 4-hydroxylase
Type:
Enzyme
Mol. Mass.:
55636.33
Organism:
Homo sapiens (Human)
Description:
P11712
Residue:
490
  
Inhibitor
Name:
BDBM50329311
Synonyms:
(R)-3-(5-Trifluoromethyl-pyridin-2-ylamino)-pyrrolidine-1-carboxylic acid 5-carbamoyl-adamantan-2-yl ester | CHEMBL1271320
Type:
Small organic molecule
Emp. Form.:
C22H27F3N4O3
Mol. Mass.:
452.47
SMILES:
NC(=O)[C@@]12CC3CC(C1)[C@H](OC(=O)N1CC[C@H](C1)Nc1ccc(cn1)C(F)(F)F)C(C3)C2
: