Target
Cell division cycle 7-related protein kinase
Ligand
BDBM50329434
Substrate
Meas. Tech.
ChEMBL_674074 (CHEMBL1274171)
IC50
200±n/a nM
Citation
 Menichincheri, MAlbanese, CAlli, CBallinari, DBargiotti, ACaldarelli, MCiavolella, ACirla, AColombo, MColotta, FCroci, VD'Alessio, RD'Anello, MErmoli, AFiorentini, FForte, BGalvani, AGiordano, PIsacchi, AMartina, KMolinari, AMoll, JKMontagnoli, AOrsini, POrzi, FPesenti, EPillan, ARoletto, FScolaro, ATatò, MTibolla, MValsasina, BVarasi, MVianello, PVolpi, DSantocanale, CVanotti, E Cdc7 kinase inhibitors: 5-heteroaryl-3-carboxamido-2-aryl pyrroles as potential antitumor agents. 1. Lead finding. J Med Chem 53:7296-315 (2010)  
Target
Name:
Cell division cycle 7-related protein kinase
Synonyms:
CDC7 CDC7L1 Cell division cycle 7-related protein kinase (CDC7) huCdc7
Type:
Protein
Mol. Mass.:
63908.16
Organism:
Homo sapiens (Human)
Description:
O00311
Residue:
574
  
Inhibitor
Name:
BDBM50329434
Synonyms:
2,5-Dipyridin-4-yl-1H-pyrrole-3-carboxamide US9670191, C3
Type:
Small organic molecule
Emp. Form.:
C15H12N4O
Mol. Mass.:
264.282
SMILES:
NC(=O)c1cc([nH]c1-c1ccncc1)-c1ccncc1
: