Target
Beta-secretase 1
Ligand
BDBM50329554
Substrate
Meas. Tech.
ChEMBL_674726 (CHEMBL1273979)
EC50
20±n/a nM
Citation
 Malamas, MSRobichaud, AErdei, JQuagliato, DSolvibile, WZhou, PMorris, KTurner, JWagner, EFan, KOlland, AJacobsen, SReinhart, PRiddell, DPangalos, M Design and synthesis of aminohydantoins as potent and selective humanß-secretase (BACE1) inhibitors with enhanced brain permeability. Bioorg Med Chem Lett 20:6597-605 (2010)  
Target
Name:
Beta-secretase 1
Synonyms:
ASP2 Aspartyl protease 2 BACE1 Beta-secretase (BACE) Beta-secretase 1 (BACE 1) Beta-secretase 1 (BACE1) Beta-site amyloid precursor protein cleaving enzyme 1 Memapsin-2 beta-Secretase (BACE-1) | beta-Secretase (BACE1)
Type:
Protein
Mol. Mass.:
55755.10
Organism:
Homo sapiens (Human)
Description:
P56817
Residue:
501
  
Inhibitor
Name:
BDBM50329554
Synonyms:
(R)-2-amino-4-(4-(difluoromethoxy)phenyl)-4-(3-(4-hydroxybut-1-ynyl)phenyl)-1-methyl-1H-imidazol-5(4H)-one | CHEMBL1271453
Type:
Small organic molecule
Emp. Form.:
C21H19F2N3O3
Mol. Mass.:
399.3907
SMILES:
CN1C(N)=N[C@](C1=O)(c1ccc(OC(F)F)cc1)c1cccc(c1)C#CCCO
: