Target
Dihydrofolate reductase
Ligand
BDBM18069
Substrate
Meas. Tech.
ChEMBL_674962 (CHEMBL1272639)
IC50
71400±n/a nM
Citation
 Beierlein, JMKarri, NGAnderson, AC Targeted mutations of Bacillus anthracis dihydrofolate reductase condense complex structure-activity relationships. J Med Chem 53:7327-36 (2010)  
Target
Name:
Dihydrofolate reductase
Synonyms:
Dihydrofolate Reductase (DHFR) | baDHFR
Type:
Enzyme
Mol. Mass.:
19120.62
Organism:
Bacillus anthracis
Description:
baDHFR was expressed in E. coli BL21, and purified to homogeneity.
Residue:
162
  
Inhibitor
Name:
BDBM18069
Synonyms:
5-[(3,4,5-trimethoxyphenyl)methyl]pyrimidine-2,4-diamine TMP Trimethoprim (TMP) | US10870625, Compound TMP
Type:
Small organic molecule
Emp. Form.:
C14H18N4O3
Mol. Mass.:
290.3177
SMILES:
COc1cc(Cc2cnc(N)nc2N)cc(OC)c1OC
: