Target
5-hydroxytryptamine receptor 1A
Ligand
BDBM50329675
Substrate
Meas. Tech.
ChEMBL_675499 (CHEMBL1273712)
Ki
0.2±n/a nM
Citation
 Lacivita, EMasotti, ACJafurulla, MSaxena, RRangaraj, NChattopadhyay, AColabufo, NABerardi, FPerrone, RLeopoldo, M Identification of a red-emitting fluorescent ligand for in vitro visualization of human serotonin 5-HT(1A) receptors. Bioorg Med Chem Lett 20:6628-32 (2010)  
Target
Name:
5-hydroxytryptamine receptor 1A
Synonyms:
5-HT-1A 5-hydroxytryptamine receptor 1A (5-HT-1A) ADRB2RL1 Dopamine D2 receptor and serotonin 1a receptor HTR1A | Serotonin receptor 1A
Type:
Mol. Mass.:
46122.49
Organism:
Homo sapiens (Human)
Description:
Residue:
422
  
Inhibitor
Name:
BDBM50329675
Synonyms:
6-methoxy-N-(4-(4-(2-methoxyphenyl)piperazin-1-yl)butyl)quinolin-2-amine N-[2-[4-(2-methoxyphenyl)-1-piperazinyl]butyl]-6-methoxy-2-quinolinamine
Type:
Small organic molecule
Emp. Form.:
C25H32N4O2
Mol. Mass.:
420.5472
SMILES:
COc1ccc2nc(NCCCCN3CCN(CC3)c3ccccc3OC)ccc2c1
: