Target
Isocitrate lyase
Ligand
BDBM50329699
Substrate
Meas. Tech.
ChEMBL_675509 (CHEMBL1273722)
IC50
14770±n/a nM
Citation
 Oh, KBJeon, HBHan, YRLee, YJPark, JLee, SHYang, DKwon, MShin, JLee, HS Bromophenols as Candida albicans isocitrate lyase inhibitors. Bioorg Med Chem Lett 20:6644-8 (2010)  
Target
Name:
Isocitrate lyase
Synonyms:
ACEA_CANAX | ICL1
Type:
PROTEIN
Mol. Mass.:
61398.95
Organism:
Candida albicans
Description:
ChEMBL_972063
Residue:
550
  
Inhibitor
Name:
BDBM50329699
Synonyms:
2,2',3-Tribromo-4,4',5,5'-tetrahydroxybibenzyl | CHEMBL1270043
Type:
Small organic molecule
Emp. Form.:
C14H11Br3O4
Mol. Mass.:
482.947
SMILES:
Oc1cc(Br)c(CCc2cc(O)c(O)c(Br)c2Br)cc1O
: