Target
TGF-beta receptor type-1
Ligand
BDBM50329786
Substrate
Meas. Tech.
ChEMBL_674821 (CHEMBL1272394)
EC50
696±n/a nM
Citation
 Roth, GJHeckel, ABrandl, TGrauert, MHoerer, SKley, JTSchnapp, GBaum, PMennerich, DSchnapp, APark, JE Design, synthesis, and evaluation of indolinones as inhibitors of the transforming growth factorß receptor I (TGFßRI). J Med Chem 53:7287-95 (2010)  
Target
Name:
TGF-beta receptor type-1
Synonyms:
ALK-5 Activin A receptor type II-like protein kinase of 53kD SKR4 TGF-beta receptor type I TGFBR1 TGFR1_HUMAN Transforming growth factor-beta receptor type I
Type:
enzyme
Mol. Mass.:
55968.24
Organism:
Homo sapiens (Human)
Description:
P36897
Residue:
503
  
Inhibitor
Name:
BDBM50329786
Synonyms:
(Z)-3-(phenyl(4-(piperidin-1-ylmethyl)phenylamino)methylene)-6-(pyrrolidine-2-carbonyl)indolin-2-one | CHEMBL1271632
Type:
Small organic molecule
Emp. Form.:
C32H34N4O2
Mol. Mass.:
506.638
SMILES:
O=C(C1CCCN1)c1ccc2C(C(=Nc3ccc(CN4CCCCC4)cc3)c3ccccc3)C(=O)Nc2c1
: