Target
TGF-beta receptor type-1
Ligand
BDBM50329804
Substrate
Meas. Tech.
ChEMBL_674821 (CHEMBL1272394)
EC50
542±n/a nM
Citation
 Roth, GJHeckel, ABrandl, TGrauert, MHoerer, SKley, JTSchnapp, GBaum, PMennerich, DSchnapp, APark, JE Design, synthesis, and evaluation of indolinones as inhibitors of the transforming growth factorß receptor I (TGFßRI). J Med Chem 53:7287-95 (2010)  
Target
Name:
TGF-beta receptor type-1
Synonyms:
ALK-5 Activin A receptor type II-like protein kinase of 53kD SKR4 TGF-beta receptor type I TGFBR1 TGFR1_HUMAN Transforming growth factor-beta receptor type I
Type:
enzyme
Mol. Mass.:
55968.24
Organism:
Homo sapiens (Human)
Description:
P36897
Residue:
503
  
Inhibitor
Name:
BDBM50329804
Synonyms:
(Z)-3-((4-(2-(diethylamino)ethylcarbamoyl)phenylamino)(phenyl)methylene)-N-ethyl-N-methyl-2-oxoindoline-6-carboxamide | CHEMBL1271576
Type:
Small organic molecule
Emp. Form.:
C32H37N5O3
Mol. Mass.:
539.6679
SMILES:
CCN(CC)CCNC(=O)c1ccc(cc1)N=C(C1C(=O)Nc2cc(ccc12)C(=O)N(C)CC)c1ccccc1
: