Target
TGF-beta receptor type-1
Ligand
BDBM50329813
Substrate
Meas. Tech.
ChEMBL_674821 (CHEMBL1272394)
EC50
597±n/a nM
Citation
 Roth, GJHeckel, ABrandl, TGrauert, MHoerer, SKley, JTSchnapp, GBaum, PMennerich, DSchnapp, APark, JE Design, synthesis, and evaluation of indolinones as inhibitors of the transforming growth factorß receptor I (TGFßRI). J Med Chem 53:7287-95 (2010)  
Target
Name:
TGF-beta receptor type-1
Synonyms:
ALK-5 Activin A receptor type II-like protein kinase of 53kD SKR4 TGF-beta receptor type I TGFBR1 TGFR1_HUMAN Transforming growth factor-beta receptor type I
Type:
enzyme
Mol. Mass.:
55968.24
Organism:
Homo sapiens (Human)
Description:
P36897
Residue:
503
  
Inhibitor
Name:
BDBM50329813
Synonyms:
(Z)-3-((4-(N-(3-(dimethylamino)propyl)acetamido)phenylamino)methylene)-N-ethyl-2-oxoindoline-6-carboxamide | CHEMBL1271965
Type:
Small organic molecule
Emp. Form.:
C25H31N5O3
Mol. Mass.:
449.5453
SMILES:
CCNC(=O)c1ccc2C(C=Nc3ccc(cc3)N(CCCN(C)C)C(C)=O)C(=O)Nc2c1
: