Target
Induced myeloid leukemia cell differentiation protein Mcl-1
Ligand
BDBM23223
Substrate
Meas. Tech.
ChEMBL_674531 (CHEMBL1274442)
Ki
180±n/a nM
Citation
 Vizirianakis, ISChatzopoulou, MBonovolias, IDNicolaou, IDemopoulos, VJTsiftsoglou, AS Toward the development of innovative bifunctional agents to induce differentiation and to promote apoptosis in leukemia: clinical candidates and perspectives. J Med Chem 53:6779-810 (2010)  
Target
Name:
Induced myeloid leukemia cell differentiation protein Mcl-1
Synonyms:
BCL2L3 Bcl-2-like protein 3 (Mcl-1) Bcl2-L-3 MCL1 Mcl-1 Myeloid cell leukemia sequence 1 (BCL2-related) | mcl1/EAT
Type:
Membrane; Single-pass membrane protein
Mol. Mass.:
37332.87
Organism:
Homo sapiens (Human)
Description:
Q07820
Residue:
350
  
Inhibitor
Name:
BDBM23223
Synonyms:
7-[8-formyl-1,6,7-trihydroxy-3-methyl-5-(propan-2-yl)naphthalen-2-yl]-2,3,8-trihydroxy-6-methyl-4-(propan-2-yl)naphthalene-1-carbaldehyde Gossypol Gossypol, 4 Tash 1 cid_3503
Type:
Small organic molecule
Emp. Form.:
C30H30O8
Mol. Mass.:
518.5544
SMILES:
CC(C)c1c(O)c(O)c(C=O)c2c(O)c(c(C)cc12)-c1c(C)cc2c(C(C)C)c(O)c(O)c(C=O)c2c1O
: