Target
Proto-oncogene tyrosine-protein kinase Src
Ligand
BDBM5416
Substrate
Meas. Tech.
ChEMBL_675745 (CHEMBL1272379)
IC50
50±n/a nM
Citation
 Machrouhi, FOuhamou, NLaderoute, KCalaoagan, JBukhtiyarova, MEhrlich, PJKlon, AE The rational design of a novel potent analogue of the 5'-AMP-activated protein kinase inhibitor compound C with improved selectivity and cellular activity. Bioorg Med Chem Lett 20:6394-9 (2010)  
Target
Name:
Proto-oncogene tyrosine-protein kinase Src
Synonyms:
Calmodulin/Proto-oncogene tyrosine-protein kinase Src Proto-oncogene c-Src SRC SRC_HUMAN V-src sarcoma (Schmidt-Ruppin A-2) viral oncogene homolog (avian) p60-Src | pp60c-src
Type:
Protein
Mol. Mass.:
59838.60
Organism:
Homo sapiens (Human)
Description:
P12931
Residue:
536
  
Inhibitor
Name:
BDBM5416
Synonyms:
4-(2-{4-[3-(pyridin-4-yl)pyrazolo[1,5-a]pyrimidin-6-yl]phenoxy}ethyl)morpholine dorsomorphin (6K1) | pyrazolo[1,5-a]pyrimidine 4h
Type:
Small organic molecule
Emp. Form.:
C23H23N5O2
Mol. Mass.:
401.461
SMILES:
C(CN1CCOCC1)Oc1ccc(cc1)-c1cnc2c(cnn2c1)-c1ccncc1
: