Target
Acyl-CoA desaturase 1
Ligand
BDBM50306131
Substrate
Meas. Tech.
ChEMBL_683827 (CHEMBL1285218)
IC50
0.06±n/a nM
Citation
 Uto, YUeno, YKiyotsuka, YMiyazawa, YKurata, HOgata, TYamada, MDeguchi, TKonishi, MTakagi, TWakimoto, SOhsumi, J Synthesis and evaluation of novel stearoyl-CoA desaturase 1 inhibitors: 1'-{6-[5-(pyridin-3-ylmethyl)-1,3,4-oxadiazol-2-yl]pyridazin-3-yl}-3,4-dihydrospiro[chromene-2,4'-piperidine] analogs. Eur J Med Chem 45:4788-96 (2010)  
Target
Name:
Acyl-CoA desaturase 1
Synonyms:
ACOD1_MOUSE | Scd1
Type:
PROTEIN
Mol. Mass.:
41064.54
Organism:
Mus musculus
Description:
ChEMBL_1462109
Residue:
355
  
Inhibitor
Name:
BDBM50306131
Synonyms:
1'-(6-(5-(pyridin-3-ylmethyl)-1,3,4-oxadiazol-2-yl)pyridazin-3-yl)-5-(trifluoromethyl)spiro[chroman-2,4'-piperidine] | CHEMBL593108
Type:
Small organic molecule
Emp. Form.:
C26H23F3N6O2
Mol. Mass.:
508.495
SMILES:
FC(F)(F)c1cccc2OC3(CCN(CC3)c3ccc(nn3)-c3nnc(Cc4cccnc4)o3)CCc12
: