Target
Acyl-CoA desaturase 1
Ligand
BDBM50330381
Substrate
Meas. Tech.
ChEMBL_683827 (CHEMBL1285218)
IC50
2±n/a nM
Citation
 Uto, YUeno, YKiyotsuka, YMiyazawa, YKurata, HOgata, TYamada, MDeguchi, TKonishi, MTakagi, TWakimoto, SOhsumi, J Synthesis and evaluation of novel stearoyl-CoA desaturase 1 inhibitors: 1'-{6-[5-(pyridin-3-ylmethyl)-1,3,4-oxadiazol-2-yl]pyridazin-3-yl}-3,4-dihydrospiro[chromene-2,4'-piperidine] analogs. Eur J Med Chem 45:4788-96 (2010)  
Target
Name:
Acyl-CoA desaturase 1
Synonyms:
ACOD1_MOUSE | Scd1
Type:
PROTEIN
Mol. Mass.:
41064.54
Organism:
Mus musculus
Description:
ChEMBL_1462109
Residue:
355
  
Inhibitor
Name:
BDBM50330381
Synonyms:
5-Fluoro-1'-{6-[5-(pyridin-3-ylmethyl)-1,3,4-oxadiazol-2-yl]pyridazin-3-yl}-3,4-dihydrospiro[chromene-2,4'-piperidine] | CHEMBL1276654
Type:
Small organic molecule
Emp. Form.:
C25H23FN6O2
Mol. Mass.:
458.4875
SMILES:
Fc1cccc2OC3(CCN(CC3)c3ccc(nn3)-c3nnc(Cc4cccnc4)o3)CCc12
: