Target
Aldo-keto reductase family 1 member A1
Ligand
BDBM50003616
Substrate
Meas. Tech.
ChEMBL_685039 (CHEMBL1286655)
IC50
50100±n/a nM
Citation
 Alexiou, PDemopoulos, VJ A diverse series of substituted benzenesulfonamides as aldose reductase inhibitors with antioxidant activity: design, synthesis, and in vitro activity. J Med Chem 53:7756-66 (2010)  
Target
Name:
Aldo-keto reductase family 1 member A1
Synonyms:
AK1A1_HUMAN ALDR1 Alcohol dehydrogenase [NADP+] Aldehyde reductase | Aldo-keto reductase family 1 member A1
Type:
Enzyme
Mol. Mass.:
36574.11
Organism:
Homo sapiens (Human)
Description:
Residue:
325
  
Inhibitor
Name:
BDBM50003616
Synonyms:
2-n-propyl-n-valeric acid DPA VALPROIC ACID dipropylacetic acid | n-DPA
Type:
Small organic molecule
Emp. Form.:
C8H16O2
Mol. Mass.:
144.2114
SMILES:
CCCC(CCC)C(O)=O
: