Target
Neuronal acetylcholine receptor subunit alpha-3/beta-4
Ligand
BDBM50143282
Substrate
Meas. Tech.
ChEMBL_684743 (CHEMBL1285770)
Ki
203±n/a nM
Citation
 Zaveri, NJiang, FOlsen, CPolgar, WToll, L Novela3ß4 nicotinic acetylcholine receptor-selective ligands. Discovery, structure-activity studies, and pharmacological evaluation. J Med Chem 53:8187-91 (2010)  
Target
Name:
Neuronal acetylcholine receptor subunit alpha-3/beta-4
Synonyms:
Neuronal acetylcholine receptor Alpha-3/Beta-4 Neuronal acetylcholine receptor; alpha3/beta4 | nAChR subtypes alpha3 beta4
Type:
Protein
Mol. Mass.:
Description:
Components:
This complex has 2 components.
Component 1
Name:
Neuronal acetylcholine receptor subunit alpha-3
Synonyms:
ACHA3_RAT Chrna3
Type:
Enzyme
Mol. Mass.:
56995.52
Organism:
Rattus norvegicus (Rat)
Description:
P04757
Residue:
499
  
Component 2
Name:
Neuronal acetylcholine receptor subunit beta-4
Synonyms:
ACHB4_RAT Chrnb4 Neuronal acetylcholine receptor non-alpha-2 chain | Neuronal acetylcholine receptor protein beta-4 subunit
Type:
Enzyme
Mol. Mass.:
55863.89
Organism:
Rattus norvegicus (Rat)
Description:
P12392
Residue:
495
  
Inhibitor
Name:
BDBM50143282
Synonyms:
(-)-cytisine (1R,9R)-7,11-diazatricyclo[7.3.1.0~2,7~]trideca-2,4-dien-6-one (1R,9S)-7,11-diazatricyclo[7.3.1.0~2,7~]trideca-2,4-dien-6-one 1,2,3,4,5,6-Hexahydro-1,5-methano-pyrido[1,2-a][1,5]diazocin-8-one CHEMBL497939 cytisine
Type:
Small organic molecule
Emp. Form.:
C11H14N2O
Mol. Mass.:
190.2417
SMILES:
O=c1cccc2[C@H]3CNC[C@H](C3)Cn12
: