Target
Mast/stem cell growth factor receptor Kit
Ligand
BDBM50331027
Substrate
Meas. Tech.
ChEMBL_684760 (CHEMBL1285787)
IC50
3±n/a nM
Citation
 Cho, TPDong, SYJun, FHong, FJLiang, YJLu, XHua, PJLi, LYLei, ZBing, HYing, ZQiong, LFBei, FBGuang, LLShen, GAHong, SGHong, SWTai, MX Novel potent orally active multitargeted receptor tyrosine kinase inhibitors: synthesis, structure-activity relationships, and antitumor activities of 2-indolinone derivatives. J Med Chem 53:8140-9 (2010)  
Target
Name:
Mast/stem cell growth factor receptor Kit
Synonyms:
CD117 antigen KIT Mast/stem cell growth factor receptor Kit (cKIT) Proto-oncogene tyrosine-protein kinase Kit Stem cell growth factor receptor Tyrosine-protein kinase Kit c-kit v-kit Hardy-Zuckerman 4 feline sarcoma viral oncogene homolog
Type:
Protein
Mol. Mass.:
109869.37
Organism:
Homo sapiens (Human)
Description:
P10721
Residue:
976
  
Inhibitor
Name:
BDBM50331027
Synonyms:
(Z)-2-(5-Fluoro-2-oxo-1,2-dihydro-indol-3-ylidenemethyl)-3-methyl-5-(2-pyrrolidin-1-yl-ethyl)-1,5,6,7-tetrahydro-pyrrolo[3,2-c]pyridin-4-one | CHEMBL1276890
Type:
Small organic molecule
Emp. Form.:
C23H25FN4O2
Mol. Mass.:
408.4686
SMILES:
Cc1c(\C=C2/C(=O)Nc3ccc(F)cc23)[nH]c2CCN(CCN3CCCC3)C(=O)c12
: