Target
Melanin-concentrating hormone receptor 1
Ligand
BDBM50331236
Substrate
Meas. Tech.
ChEMBL_686508 (CHEMBL1292295)
Ki
5.2±n/a nM
Citation
 Surman, MDFreeman, EEGrabowski, JFHadden, MHenderson, AJJiang, GJiang, XMLuche, MKhmelnitsky, YVickers, SViggers, JCheetham, SGuzzo, PR 5-(pyridinon-1-yl)indazoles and 5-(furopyridinon-5-yl)indazoles as MCH-1 antagonists. Bioorg Med Chem Lett 20:7015-9 (2010)  
Target
Name:
Melanin-concentrating hormone receptor 1
Synonyms:
G-protein coupled receptor 24 MCH receptor 1 MCH-R1 MCHR-1 MCHR1_HUMAN Melanin-Concentrating Hormone Receptor 1 (MCH1R) Melanin-concentrating hormone receptor 1 (MCH-1) Melanin-concentrating hormone receptor 1 (MCHR-1) SLC-1 Somatostatin receptor-like protein
Type:
G Protein-Coupled Receptor (GPCR)
Mol. Mass.:
45976.27
Organism:
Homo sapiens (Human)
Description:
Membranes from CHO-K1 cells stably expressing human MCH1R were used in assays.
Residue:
422
  
Inhibitor
Name:
BDBM50331236
Synonyms:
2-(4-chlorophenyl)-5-(1-(2-(pyrrolidin-1-yl)ethyl)-1H-indazol-5-yl)furo[3,2-c]pyridin-4(5H)-one | CHEMBL1290383
Type:
Small organic molecule
Emp. Form.:
C26H23ClN4O2
Mol. Mass.:
458.939
SMILES:
Clc1ccc(cc1)-c1cc2c(ccn(-c3ccc4n(CCN5CCCC5)ncc4c3)c2=O)o1
: