Target
Melanin-concentrating hormone receptor 1
Ligand
BDBM50331238
Substrate
Meas. Tech.
ChEMBL_686508 (CHEMBL1292295)
Ki
22.6±n/a nM
Citation
 Surman, MDFreeman, EEGrabowski, JFHadden, MHenderson, AJJiang, GJiang, XMLuche, MKhmelnitsky, YVickers, SViggers, JCheetham, SGuzzo, PR 5-(pyridinon-1-yl)indazoles and 5-(furopyridinon-5-yl)indazoles as MCH-1 antagonists. Bioorg Med Chem Lett 20:7015-9 (2010)  
Target
Name:
Melanin-concentrating hormone receptor 1
Synonyms:
G-protein coupled receptor 24 MCH receptor 1 MCH-R1 MCHR-1 MCHR1_HUMAN Melanin-Concentrating Hormone Receptor 1 (MCH1R) Melanin-concentrating hormone receptor 1 (MCH-1) Melanin-concentrating hormone receptor 1 (MCHR-1) SLC-1 Somatostatin receptor-like protein
Type:
G Protein-Coupled Receptor (GPCR)
Mol. Mass.:
45976.27
Organism:
Homo sapiens (Human)
Description:
Membranes from CHO-K1 cells stably expressing human MCH1R were used in assays.
Residue:
422
  
Inhibitor
Name:
BDBM50331238
Synonyms:
4-(benzyloxy)-1-(1-((4,5-dihydro-1H-imidazol-2-yl)methyl)-1H-indazol-5-yl)pyridin-2(1H)-one | CHEMBL1289053
Type:
Small organic molecule
Emp. Form.:
C23H21N5O2
Mol. Mass.:
399.4451
SMILES:
O=c1cc(OCc2ccccc2)ccn1-c1ccc2n(CC3=NCCN3)ncc2c1
: