Target
Vascular endothelial growth factor receptor 3
Ligand
BDBM50331618
Substrate
Meas. Tech.
ChEMBL_687450 (CHEMBL1292126)
Ki
1090±n/a nM
Citation
 Krug, MErlenkamp, GSippl, WSchächtele, CTotzke, FHilgeroth, A Discovery and selectivity-profiling of 4-benzylamino 1-aza-9-oxafluorene derivatives as lead structures for IGF-1R inhibitors. Bioorg Med Chem Lett 20:6915-9 (2010)  
Target
Name:
Vascular endothelial growth factor receptor 3
Synonyms:
FLT-4 Fms-like tyrosine kinase 4 VEGFR-3 VGFR3_HUMAN Vascular endothelial growth factor receptor 3 (VEGFR-3) | Vascular endothelial growth factor receptor 3 (VEGFR3)
Type:
Protein
Mol. Mass.:
152749.58
Organism:
Homo sapiens (Human)
Description:
P35916-2
Residue:
1363
  
Inhibitor
Name:
BDBM50331618
Synonyms:
CHEMBL1289976 | N-benzylbenzofuro[2,3-b]pyridin-4-amine
Type:
Small organic molecule
Emp. Form.:
C18H14N2O
Mol. Mass.:
274.3166
SMILES:
C(Nc1ccnc2oc3ccccc3c12)c1ccccc1
: