Target
Vascular endothelial growth factor receptor 3
Ligand
BDBM50331615
Substrate
Meas. Tech.
ChEMBL_687450 (CHEMBL1292126)
Ki
>1000000±n/a nM
Citation
 Krug, MErlenkamp, GSippl, WSchächtele, CTotzke, FHilgeroth, A Discovery and selectivity-profiling of 4-benzylamino 1-aza-9-oxafluorene derivatives as lead structures for IGF-1R inhibitors. Bioorg Med Chem Lett 20:6915-9 (2010)  
Target
Name:
Vascular endothelial growth factor receptor 3
Synonyms:
FLT-4 Fms-like tyrosine kinase 4 VEGFR-3 VGFR3_HUMAN Vascular endothelial growth factor receptor 3 (VEGFR-3) | Vascular endothelial growth factor receptor 3 (VEGFR3)
Type:
Protein
Mol. Mass.:
152749.58
Organism:
Homo sapiens (Human)
Description:
P35916-2
Residue:
1363
  
Inhibitor
Name:
BDBM50331615
Synonyms:
CHEMBL1290073 | N-(3-chlorobenzyl)benzofuro[2,3-b]pyridin-4-amine
Type:
Small organic molecule
Emp. Form.:
C18H13ClN2O
Mol. Mass.:
308.762
SMILES:
Clc1cccc(CNc2ccnc3oc4ccccc4c23)c1
: