Target
Vascular endothelial growth factor receptor 2
Ligand
BDBM50331612
Substrate
Meas. Tech.
ChEMBL_687451 (CHEMBL1292127)
Ki
>1000000±n/a nM
Citation
 Krug, MErlenkamp, GSippl, WSchächtele, CTotzke, FHilgeroth, A Discovery and selectivity-profiling of 4-benzylamino 1-aza-9-oxafluorene derivatives as lead structures for IGF-1R inhibitors. Bioorg Med Chem Lett 20:6915-9 (2010)  
Target
Name:
Vascular endothelial growth factor receptor 2
Synonyms:
CD_antigen=CD309 Fetal liver kinase 1 (FLK-1) KDR Protein-tyrosine kinase receptor Flk-1 VEGFR-2 VEGFR2 Vascular Endothelial Growth Factor Receptor Kinase 2 Vascular endothelial growth factor receptor 2 (KDR) Vascular endothelial growth factor receptor 2 (VEGFR2) Vascular endothelial growth factor receptor-2 (VEGFR-2)
Type:
Receptor Tyrosine Kinase
Mol. Mass.:
151510.97
Organism:
Homo sapiens (Human)
Description:
P35968
Residue:
1356
  
Inhibitor
Name:
BDBM50331612
Synonyms:
CHEMBL1290072 | N-(4-methoxybenzyl)benzofuro[2,3-b]pyridin-4-amine
Type:
Small organic molecule
Emp. Form.:
C19H16N2O2
Mol. Mass.:
304.3425
SMILES:
COc1ccc(CNc2ccnc3oc4ccccc4c23)cc1
: