Target
Phospholipase C
Ligand
BDBM50332108
Substrate
Meas. Tech.
ChEMBL_687786 (CHEMBL1291232)
IC50
77000±n/a nM
Citation
 González-Bulnes, PGonzález-Roura, ACanals, DDelgado, ACasas, JLlebaria, A 2-aminohydroxamic acid derivatives as inhibitors of Bacillus cereus phosphatidylcholine preferred phospholipase C PC-PLC(Bc). Bioorg Med Chem 18:8549-55 (2010)  
Target
Name:
Phospholipase C
Synonyms:
Cereolysin A Phosphatidylcholine cholinephosphohydrolase | plc
Type:
PROTEIN
Mol. Mass.:
32387.39
Organism:
Bacillus cereus
Description:
ChEMBL_687786
Residue:
283
  
Inhibitor
Name:
BDBM50332108
Synonyms:
CHEMBL1287860 | Tert-butyl 1-(benzyloxy(3-(dimethylamino)propyl)amino)-1-oxooctan-2-ylcarbamate
Type:
Small organic molecule
Emp. Form.:
C25H43N3O4
Mol. Mass.:
449.6266
SMILES:
CCCCCCC(NC(=O)OC(C)(C)C)C(=O)N(CCCN(C)C)OCc1ccccc1
: