Target
Myeloperoxidase
Ligand
BDBM50332585
Substrate
Meas. Tech.
ChEMBL_695893 (CHEMBL1640945)
IC50
170±n/a nM
Citation
 Soubhye, JPrévost, MVan Antwerpen, PZouaoui Boudjeltia, KRousseau, AFurtmüller, PGObinger, CVanhaeverbeek, MDucobu, JNéve, JGelbcke, MDufrasne, FO Structure-based design, synthesis, and pharmacological evaluation of 3-(aminoalkyl)-5-fluoroindoles as myeloperoxidase inhibitors. J Med Chem 53:8747-59 (2010)  
Target
Name:
Myeloperoxidase
Synonyms:
84 kDa myeloperoxidase MPO Myeloperoxidase Myeloperoxidase heavy chain PERM_HUMAN
Type:
Enzyme
Mol. Mass.:
83888.32
Organism:
Homo sapiens (Human)
Description:
P05164
Residue:
745
  
Inhibitor
Name:
BDBM50332585
Synonyms:
3-(5-fluoro-1H-indol-3-yl)-N-propylpropan-1-amine | CHEMBL1630736
Type:
Small organic molecule
Emp. Form.:
C14H19FN2
Mol. Mass.:
234.3125
SMILES:
CCCNCCCc1c[nH]c2ccc(F)cc12
: