Target
Myeloperoxidase
Ligand
BDBM50332587
Substrate
Meas. Tech.
ChEMBL_695893 (CHEMBL1640945)
IC50
350±n/a nM
Citation
 Soubhye, JPrévost, MVan Antwerpen, PZouaoui Boudjeltia, KRousseau, AFurtmüller, PGObinger, CVanhaeverbeek, MDucobu, JNéve, JGelbcke, MDufrasne, FO Structure-based design, synthesis, and pharmacological evaluation of 3-(aminoalkyl)-5-fluoroindoles as myeloperoxidase inhibitors. J Med Chem 53:8747-59 (2010)  
Target
Name:
Myeloperoxidase
Synonyms:
84 kDa myeloperoxidase MPO Myeloperoxidase Myeloperoxidase heavy chain PERM_HUMAN
Type:
Enzyme
Mol. Mass.:
83888.32
Organism:
Homo sapiens (Human)
Description:
P05164
Residue:
745
  
Inhibitor
Name:
BDBM50332587
Synonyms:
CHEMBL1630738 | N,N-diethyl-3-(5-fluoro-1H-indol-3-yl)propan-1-amine
Type:
Small organic molecule
Emp. Form.:
C15H21FN2
Mol. Mass.:
248.339
SMILES:
CCN(CC)CCCc1c[nH]c2ccc(F)cc12
: