Target
Myeloperoxidase
Ligand
BDBM50332571
Substrate
Meas. Tech.
ChEMBL_695894 (CHEMBL1640946)
IC50
>1000±n/a nM
Citation
 Soubhye, JPrévost, MVan Antwerpen, PZouaoui Boudjeltia, KRousseau, AFurtmüller, PGObinger, CVanhaeverbeek, MDucobu, JNéve, JGelbcke, MDufrasne, FO Structure-based design, synthesis, and pharmacological evaluation of 3-(aminoalkyl)-5-fluoroindoles as myeloperoxidase inhibitors. J Med Chem 53:8747-59 (2010)  
Target
Name:
Myeloperoxidase
Synonyms:
84 kDa myeloperoxidase MPO Myeloperoxidase Myeloperoxidase heavy chain PERM_HUMAN
Type:
Enzyme
Mol. Mass.:
83888.32
Organism:
Homo sapiens (Human)
Description:
P05164
Residue:
745
  
Inhibitor
Name:
BDBM50332571
Synonyms:
(5-fluoro-1H-indol-3-yl)methanamine | CHEMBL1630722
Type:
Small organic molecule
Emp. Form.:
C9H9FN2
Mol. Mass.:
164.1796
SMILES:
NCc1c[nH]c2ccc(F)cc12
: