Target
Myeloperoxidase
Ligand
BDBM50332573
Substrate
Meas. Tech.
ChEMBL_695894 (CHEMBL1640946)
IC50
>1000±n/a nM
Citation
 Soubhye, JPrévost, MVan Antwerpen, PZouaoui Boudjeltia, KRousseau, AFurtmüller, PGObinger, CVanhaeverbeek, MDucobu, JNéve, JGelbcke, MDufrasne, FO Structure-based design, synthesis, and pharmacological evaluation of 3-(aminoalkyl)-5-fluoroindoles as myeloperoxidase inhibitors. J Med Chem 53:8747-59 (2010)  
Target
Name:
Myeloperoxidase
Synonyms:
84 kDa myeloperoxidase MPO Myeloperoxidase Myeloperoxidase heavy chain PERM_HUMAN
Type:
Enzyme
Mol. Mass.:
83888.32
Organism:
Homo sapiens (Human)
Description:
P05164
Residue:
745
  
Inhibitor
Name:
BDBM50332573
Synonyms:
5-fluoro-3-((4-methylpiperazin-1-yl)methyl)-1H-indole | CHEMBL1630724
Type:
Small organic molecule
Emp. Form.:
C14H18FN3
Mol. Mass.:
247.3112
SMILES:
CN1CCN(Cc2c[nH]c3ccc(F)cc23)CC1
: