Target
Aldehyde oxidase 1
Ligand
BDBM82507
Substrate
Meas. Tech.
ChEMBL_696366 (CHEMBL1640079)
Ki
30±n/a nM
Citation
 Pryde, DCDalvie, DHu, QJones, PObach, RSTran, TD Aldehyde oxidase: an enzyme of emerging importance in drug discovery. J Med Chem 53:8441-60 (2010)  
Target
Name:
Aldehyde oxidase 1
Synonyms:
AOXA_RAT Ao | Aox1
Type:
PROTEIN
Mol. Mass.:
146930.28
Organism:
Rattus norvegicus
Description:
ChEMBL_696366
Residue:
1333
  
Inhibitor
Name:
BDBM82507
Synonyms:
(+/-)-Methadone METHADONE NSC_22266
Type:
Small organic molecule
Emp. Form.:
C21H27NO
Mol. Mass.:
309.4452
SMILES:
CCC(=O)C(CC(C)N(C)C)(c1ccccc1)c1ccccc1
: