Target
Ectonucleotide pyrophosphatase/phosphodiesterase family member 2
Ligand
BDBM50332927
Substrate
Meas. Tech.
ChEMBL_694284 (CHEMBL1637646)
Ki
367±n/a nM
Citation
 East, JEKennedy, AJTomsig, JLDe Leon, ARLynch, KRMacdonald, TL Synthesis and structure-activity relationships of tyrosine-based inhibitors of autotaxin (ATX). Bioorg Med Chem Lett 20:7132-6 (2010)  
Target
Name:
Ectonucleotide pyrophosphatase/phosphodiesterase family member 2
Synonyms:
ATX Autotaxin (ATX) ENPP2 Ectonucleotide Pyrophosphatase/Phosphodiesterase 2 (ENPP2) Extracellular lysophospholipase D PDNP2
Type:
Enzyme
Mol. Mass.:
99007.13
Organism:
Homo sapiens (Human)
Description:
Q13822
Residue:
863
  
Inhibitor
Name:
BDBM50332927
Synonyms:
4-tetradecanamidobenzylphosphonic acid | CHEMBL1632623
Type:
Small organic molecule
Emp. Form.:
C21H36NO4P
Mol. Mass.:
397.4886
SMILES:
CCCCCCCCCCCCCC(=O)Nc1ccc(CP(O)(O)=O)cc1
: