Target
Prostaglandin G/H synthase 2
Ligand
BDBM50332940
Substrate
Meas. Tech.
ChEMBL_694506 (CHEMBL1635796)
IC50
147000±n/a nM
Citation
 Yoshikawa, KYagi, CHama, HTanaka, MArihara, SHashimoto, T Ipomotaosides A-D, resin glycosides from the aerial parts of Ipomoea batatas and their inhibitory activity against COX-1 and COX-2. J Nat Prod 73:1763-6 (2010)  
Target
Name:
Prostaglandin G/H synthase 2
Synonyms:
COX2 Cyclooxygenase-2 (COX-2) PTGS2 Prostaglandin G/H synthase (cyclooxygenase)
Type:
Protein
Mol. Mass.:
68976.98
Organism:
Ovis aries (Sheep)
Description:
Residue:
603
  
Inhibitor
Name:
BDBM50332940
Synonyms:
(S)-jalapinolic acid 11-O-(2-O-trans-cinnamoyl)-[(4-O-n-dodecanoyl)]-alpha-L-rhamnopyranosyl-(1->4)-O-(2-O-n-dodecanoyl)-alpha-L-rhamnopyranosyl-(1->4)-O-alpha-L-rhamnopyranosyl-(1->2)-O-beta-D-fucopyranoside 1,2'' ester | CHEMBL1631410
Type:
Small organic molecule
Emp. Form.:
C73H120O21
Mol. Mass.:
1333.7213
SMILES:
CCCCCCCCCCCC(=O)O[C@H]1[C@H](C)O[C@@H](O[C@H]2[C@H](C)O[C@@H](O[C@H]3[C@H](C)O[C@H]4O[C@@H]5[C@@H](O)[C@@H](O)[C@@H](C)O[C@H]5O[C@@H](CCCCC)CCCCCCCCCC(=O)O[C@@H]4[C@@H]3O)[C@H](OC(=O)CCCCCCCCCCC)[C@@H]2O)[C@H](OC(=O)\C=C\c2ccccc2)[C@@H]1O
: