Target
Eukaryotic translation initiation factor 4E
Ligand
BDBM36609
Substrate
Meas. Tech.
ChEMBL_696802 (CHEMBL1639015)
Kd
0.5±n/a nM
Citation
 Sadovski, OJaikaran, ASSamanta, SFabian, MRDowling, RJSonenberg, NWoolley, GA A collection of caged compounds for probing roles of local translation in neurobiology. Bioorg Med Chem 18:7746-52 (2010)  
Target
Name:
Eukaryotic translation initiation factor 4E
Synonyms:
EIF4E EIF4F Eukaryotic translation initiation factor 4E (eIF4E) IF4E_HUMAN
Type:
Protein
Mol. Mass.:
25095.44
Organism:
Homo sapiens (Human)
Description:
P06730
Residue:
217
  
Inhibitor
Name:
BDBM36609
Synonyms:
Rapamycin C-7, analog 4 US11603377, Compound Ramycin
Type:
Small organic molecule
Emp. Form.:
C51H79NO13
Mol. Mass.:
914.1719
SMILES:
CO[C@@H]1C[C@H](C[C@@H](C)[C@@H]2CC(=O)[C@H](C)\C=C(C)\[C@@H](O)[C@@H](OC)C(=O)[C@H](C)C[C@H](C)\C=C\C=C\C=C(C)\[C@H](C[C@@H]3CC[C@@H](C)[C@@](O)(O3)C(=O)C(=O)N3CCCC[C@H]3C(=O)O2)OC)CC[C@H]1O
: