Target
Sucrase-isomaltase, intestinal
Ligand
BDBM50242271
Substrate
Meas. Tech.
ChEMBL_698925 (CHEMBL1645865)
IC50
1000±n/a nM
Citation
 Natori, YImahori, TMurakami, KYoshimura, YNakagawa, SKato, AAdachi, ITakahata, H The synthesis and biological evaluation of 1-C-alkyl-L-arabinoiminofuranoses, a novel class ofa-glucosidase inhibitors. Bioorg Med Chem Lett 21:738-41 (2011)  
Target
Name:
Sucrase-isomaltase, intestinal
Synonyms:
SUIS_RAT Sucrase-isomaltase | alpha-Glucosidase (α-Glucosidase)
Type:
Enzyme
Mol. Mass.:
210329.04
Organism:
Rattus norvegicus (Rat)
Description:
P23739
Residue:
1841
  
Inhibitor
Name:
BDBM50242271
Synonyms:
(2R,3R,4R,5S)-1-(2-hydroxyethyl)-2-(hydroxymethyl)piperidine-3,4,5-triol BAY-M-1099 Glyset N-Hydroxyethyl-1-deoxynojirimycin | cid_441314
Type:
Small organic molecule
Emp. Form.:
C8H17NO5
Mol. Mass.:
207.2243
SMILES:
OCCN1C[C@H](O)[C@@H](O)[C@H](O)[C@H]1CO
: