Target
Carbonic anhydrase 6
Ligand
BDBM11638
Substrate
Meas. Tech.
ChEMBL_700657 (CHEMBL1645696)
Ki
0.8±n/a nM
Citation
 Bertucci, AInnocenti, AScozzafava, ATambutté, SZoccola, DSupuran, CT Carbonic anhydrase inhibitors. Inhibition studies with anions and sulfonamides of a new cytosolic enzyme from the scleractinian coral Stylophora pistillata. Bioorg Med Chem Lett 21:710-4 (2011)  
Target
Name:
Carbonic anhydrase 6
Synonyms:
CA-VI CAH6_HUMAN Carbonic Anhydrase VI Carbonic anhydrase 6 Carbonic anhydrase 6 (CA-VI) Salivary carbonic anhydrase | Secreted carbonic anhydrase
Type:
Enzyme
Mol. Mass.:
35371.40
Organism:
Homo sapiens (Human)
Description:
P23280
Residue:
308
  
Inhibitor
Name:
BDBM11638
Synonyms:
CHEMBL26 N-[(1-ethylpyrrolidin-2-yl)methyl]-2-methoxy-5-sulfamoylbenzamide SULPIRIDE,(-) Sulpiride, SLP US10172837, Sulpiride
Type:
Small organic molecule
Emp. Form.:
C15H23N3O4S
Mol. Mass.:
341.426
SMILES:
CCN1CCCC1CNC(=O)c1cc(ccc1OC)S(N)(=O)=O
: