Target
C-X-C chemokine receptor type 4
Ligand
BDBM50333894
Substrate
Meas. Tech.
ChEMBL_700061 (CHEMBL1646838)
IC50
10±n/a nM
Citation
 Skerlj, RBridger, GMcEachern, EHarwig, CSmith, CWilson, TVeale, DYee, HCrawford, JSkupinska, KWauthy, RYang, WZhu, YBogucki, DDi Fluri, MLangille, JHuskens, DDe Clercq, ESchols, D Synthesis and SAR of novel CXCR4 antagonists that are potent inhibitors of T tropic (X4) HIV-1 replication. Bioorg Med Chem Lett 21:262-6 (2010)  
Target
Name:
C-X-C chemokine receptor type 4
Synonyms:
C-X-C chemokine receptor type 4 CD_antigen=CD184 CXCR-4 CXCR4_HUMAN Fusin LCR1 Leukocyte-derived seven transmembrane domain receptor SDF-1 receptor | Stromal cell-derived factor 1 receptor
Type:
Enzyme
Mol. Mass.:
39754.61
Organism:
Homo sapiens (Human)
Description:
P61073
Residue:
352
  
Inhibitor
Name:
BDBM50333894
Synonyms:
CHEMBL1644073 | [4-((((1H-benzo[d]imidazol-2-yl)methyl(5,6,7,8-tetrahydroquinolin-8-yl)amino)methyl-1,3-phenylene]diamethanamine
Type:
Small organic molecule
Emp. Form.:
C26H30N6
Mol. Mass.:
426.5566
SMILES:
NCc1ccc(CN(Cc2nc3ccccc3[nH]2)C2CCCc3cccnc23)c(CN)c1
: