Target
Mitogen-activated protein kinase 10
Ligand
BDBM50333998
Substrate
Meas. Tech.
ChEMBL_700502 (CHEMBL1648161)
IC50
54±n/a nM
Citation
 Probst, GDBowers, SSealy, JMTruong, APHom, RKGalemmo, RAKonradi, AWSham, HLQuincy, DAPan, HYao, NLin, MTóth, GArtis, DRZmolek, WWong, KQin, ALorentzen, CNakamura, DFQuinn, KPSauer, JMPowell, KRuslim, LWright, SChereau, DRen, ZAnderson, JPBard, FYednock, TAGriswold-Prenner, I Highly selective c-Jun N-terminal kinase (JNK) 2 and 3 inhibitors with in vitro CNS-like pharmacokinetic properties prevent neurodegeneration. Bioorg Med Chem Lett 21:315-9 (2010)  
Target
Name:
Mitogen-activated protein kinase 10
Synonyms:
JNK3 MAP kinase p49 3F12 MK10_HUMAN Mitogen-activated protein kinase 10 (Stress-activated protein kinase JNK3) (c-Jun N-terminal kinase 3) (MAP kinase p49 3F12) PRKM10 Stress-activated protein kinase JNK3 | c-Jun N-terminal kinase 3 (JNK3)
Type:
Enzyme
Mol. Mass.:
52586.89
Organism:
Homo sapiens (Human)
Description:
Residue:
464
  
Inhibitor
Name:
BDBM50333998
Synonyms:
4-(8-fluoronaphthalen-2-yl)-3-(2-(tetrahydro-2H-pyran-4-ylamino)pyridin-4-yl)-1H-1,2,4-triazol-5(4H)-one | CHEMBL1644635
Type:
Small organic molecule
Emp. Form.:
C22H20FN5O2
Mol. Mass.:
405.4249
SMILES:
Fc1cccc2ccc(cc12)-n1c(n[nH]c1=O)-c1ccnc(NC2CCOCC2)c1
: