Target
Mitogen-activated protein kinase 1
Ligand
BDBM50333984
Substrate
Meas. Tech.
ChEMBL_701208 (CHEMBL1648828)
IC50
>50000±n/a nM
Citation
 Probst, GDBowers, SSealy, JMTruong, APHom, RKGalemmo, RAKonradi, AWSham, HLQuincy, DAPan, HYao, NLin, MTóth, GArtis, DRZmolek, WWong, KQin, ALorentzen, CNakamura, DFQuinn, KPSauer, JMPowell, KRuslim, LWright, SChereau, DRen, ZAnderson, JPBard, FYednock, TAGriswold-Prenner, I Highly selective c-Jun N-terminal kinase (JNK) 2 and 3 inhibitors with in vitro CNS-like pharmacokinetic properties prevent neurodegeneration. Bioorg Med Chem Lett 21:315-9 (2010)  
Target
Name:
Mitogen-activated protein kinase 1
Synonyms:
ERK2 Extracellular signal-regulated kinase 2 Extracellular signal-regulated kinase 2 (ERK2) MAPK 2 MK01_HUMAN Mitogen-activated protein kinase 1 (ERK-2) Mitogen-activated protein kinase 2 PRKM2 | p42-MAPK
Type:
Ser/Thr Protein Kinase
Mol. Mass.:
41392.76
Organism:
Homo sapiens (Human)
Description:
P28482
Residue:
360
  
Inhibitor
Name:
BDBM50333984
Synonyms:
CHEMBL1644630 | N-(4-(4-(naphthalen-2-yl)-5-oxo-4,5-dihydro-1H-1,2,4-triazol-3-yl)pyridin-2-yl)cyclopropanecarboxamide
Type:
Small organic molecule
Emp. Form.:
C21H17N5O2
Mol. Mass.:
371.392
SMILES:
O=C(Nc1cc(ccn1)-c1n[nH]c(=O)n1-c1ccc2ccccc2c1)C1CC1
: