Target
5-hydroxytryptamine receptor 6
Ligand
BDBM50334249
Substrate
Meas. Tech.
ChEMBL_699426 (CHEMBL1647453)
Ki
11.8±n/a nM
Citation
 Nirogi, RVDeshpande, ADKambhampati, RBadange, RKKota, LDaulatabad, AVShinde, AKAhmad, IKandikere, VJayarajan, PDubey, PK Indole-3-piperazinyl derivatives: novel chemical class of 5-HT(6) receptor antagonists. Bioorg Med Chem Lett 21:346-9 (2010)  
Target
Name:
5-hydroxytryptamine receptor 6
Synonyms:
5-HT-6 5-hydroxytryptamine receptor 6 (5-HT-6) 5-hydroxytryptamine receptor 6 (5HT6) HTR6 Serotonin 6 (5-HT6) receptor | Serotonin Receptor 6
Type:
G Protein-Coupled Receptor (GPCR)
Mol. Mass.:
46968.43
Organism:
Homo sapiens (Human)
Description:
P50406
Residue:
440
  
Inhibitor
Name:
BDBM50334249
Synonyms:
1-(4-Fluorobenzenesulfonyl)-3-(4-methylpiperazin-1-yl)-1H-indole | CHEMBL1642413
Type:
Small organic molecule
Emp. Form.:
C19H20FN3O2S
Mol. Mass.:
373.444
SMILES:
CN1CCN(CC1)c1cn(c2ccccc12)S(=O)(=O)c1ccc(F)cc1
: