Target
Neuronal acetylcholine receptor subunit alpha-6
Ligand
BDBM50334470
Substrate
Meas. Tech.
ChEMBL_701134 (CHEMBL1648232)
IC50
8.59±n/a nM
Citation
 Zhang, ZZheng, GPivavarchyk, MDeaciuc, AGDwoskin, LPCrooks, PA Novel bis-, tris-, and tetrakis-tertiary amino analogs as antagonists at neuronal nicotinic receptors that mediate nicotine-evoked dopamine release. Bioorg Med Chem Lett 21:88-91 (2010)  
Target
Name:
Neuronal acetylcholine receptor subunit alpha-6
Synonyms:
ACHA6_RAT Chrna6 Neuronal acetylcholine receptor subunit alpha-6 | Neuronal acetylcholine receptor subunit alpha-6/beta-3
Type:
PROTEIN
Mol. Mass.:
56943.53
Organism:
Rattus norvegicus
Description:
ChEMBL_1454451
Residue:
493
  
Inhibitor
Name:
BDBM50334470
Synonyms:
1,12-bis(3,4-dihydroisoquinolin-2(1H)-yl)dodecane | CHEMBL1643946
Type:
Small organic molecule
Emp. Form.:
C30H44N2
Mol. Mass.:
432.6838
SMILES:
C(CCCCCCN1CCc2ccccc2C1)CCCCCN1CCc2ccccc2C1
: