Target
5-hydroxytryptamine receptor 6
Ligand
BDBM50334727
Substrate
Meas. Tech.
ChEMBL_699278 (CHEMBL1647098)
Ki
2.9±n/a nM
Citation
 Liu, KGRobichaud, AJGreenfield, AALo, JRGrosanu, CMattes, JFCai, YZhang, GMZhang, JYKowal, DMSmith, DLDi, LKerns, EHSchechter, LEComery, TA Identification of 3-sulfonylindazole derivatives as potent and selective 5-HT(6) antagonists. Bioorg Med Chem 19:650-62 (2011)  
Target
Name:
5-hydroxytryptamine receptor 6
Synonyms:
5-HT-6 5-hydroxytryptamine receptor 6 (5-HT-6) 5-hydroxytryptamine receptor 6 (5HT6) HTR6 Serotonin 6 (5-HT6) receptor | Serotonin Receptor 6
Type:
G Protein-Coupled Receptor (GPCR)
Mol. Mass.:
46968.43
Organism:
Homo sapiens (Human)
Description:
P50406
Residue:
440
  
Inhibitor
Name:
BDBM50334727
Synonyms:
CHEMBL1642878 | N-[2-(Dimethylamino)ethyl]-3-(1-naphthylsulfonyl)-1Hindazole-5-carboxamide HCl
Type:
Small organic molecule
Emp. Form.:
C22H22N4O3S
Mol. Mass.:
422.5
SMILES:
CN(C)CCNC(=O)c1ccc2[nH]nc(c2c1)S(=O)(=O)c1cccc2ccccc12
: