Target
Sphingosine 1-phosphate receptor 3
Ligand
BDBM50158345
Substrate
Meas. Tech.
ChEMBL_701954 (CHEMBL1657526)
IC50
>10±n/a nM
Citation
 Saha, AKYu, XLin, JLobera, MSharadendu, AChereku, SSchutz, NSegal, DMarantz, YMcCauley, DMiddleton, SSiu, JBörli, RWBuys, JHorner, MSalyers, KSchrag, MVargas, HMXu, YMcElvain, M Benzofuran Derivatives as Potent, Orally Active S1P1 Receptor Agonists: A Preclinical Lead Molecule for MS ACS Med Chem Lett 2:97-101 (2011)  
Target
Name:
Sphingosine 1-phosphate receptor 3
Synonyms:
C9orf108 EDG3 S1P receptor 3 S1P3 S1PR3_HUMAN Sphingosine 1-phosphate receptor 3 (S1P3) | Sphingosine 1-phosphate receptor Edg-3
Type:
G Protein-Coupled Receptor (GPCR)
Mol. Mass.:
42278.13
Organism:
Homo sapiens (Human)
Description:
Q99500
Residue:
378
  
Inhibitor
Name:
BDBM50158345
Synonyms:
5-(4-phenyl-5-(trifluoromethyl)thiophen-2-yl)-3-(3-(trifluoromethyl)phenyl)-1,2,4-oxadiazole | CHEMBL224720
Type:
Small organic molecule
Emp. Form.:
C20H10F6N2OS
Mol. Mass.:
440.362
SMILES:
FC(F)(F)c1sc(cc1-c1ccccc1)-c1nc(no1)-c1cccc(c1)C(F)(F)F
: