Target
Cannabinoid receptor 2
Ligand
BDBM50309539
Substrate
Meas. Tech.
ChEMBL_717853 (CHEMBL1670561)
Ki
9.8±n/a nM
Citation
 Brogi, SCorelli, FDi Marzo, VLigresti, AMugnaini, CPasquini, STafi, A Three-dimensional quantitative structure-selectivity relationships analysis guided rational design of a highly selective ligand for the cannabinoid receptor 2. Eur J Med Chem 46:547-55 (2011)  
Target
Name:
Cannabinoid receptor 2
Synonyms:
CANNABINOID CB2 CB2 CB2B CNR2_HUMAN Cannabinoid CB2 receptor Cannabinoid receptor 2 (CB2R) | hCB2
Type:
G Protein-Coupled Receptor (GPCR)
Mol. Mass.:
39690.94
Organism:
Homo sapiens (Human)
Description:
P34972
Residue:
360
  
Inhibitor
Name:
BDBM50309539
Synonyms:
5-Butyl-2-methyl-1-phenyl-1H-imidazole-4-carboxylic acid adamantan-1-ylamide | CHEMBL597438
Type:
Small organic molecule
Emp. Form.:
C25H33N3O
Mol. Mass.:
391.549
SMILES:
CCCCc1c(nc(C)n1-c1ccccc1)C(=O)NC12CC3CC(CC(C3)C1)C2
: