Target
Bifunctional epoxide hydrolase 2
Ligand
BDBM50335977
Substrate
Meas. Tech.
ChEMBL_716996 (CHEMBL1671068)
IC50
58±n/a nM
Citation
 Anandan, SKWebb, HKChen, DWang, YXAavula, BRCases, SCheng, YDo, ZNMehra, UTran, VVincelette, JWaszczuk, JWhite, KWong, KRZhang, LNJones, PDHammock, BDPatel, DVWhitcomb, RMacIntyre, DESabry, JGless, R 1-(1-acetyl-piperidin-4-yl)-3-adamantan-1-yl-urea (AR9281) as a potent, selective, and orally available soluble epoxide hydrolase inhibitor with efficacy in rodent models of hypertension and dysglycemia. Bioorg Med Chem Lett 21:983-8 (2011)  
Target
Name:
Bifunctional epoxide hydrolase 2
Synonyms:
Cytosolic epoxide hydrolase 2 EPHX2 HYES_HUMAN Soluble epoxide hydrolase (sEH) | epoxide hydrolase 2, cytoplasmic
Type:
Enzyme
Mol. Mass.:
62613.07
Organism:
Homo sapiens (Human)
Description:
P34913
Residue:
555
  
Inhibitor
Name:
BDBM50335977
Synonyms:
1-(1-Acetyl-piperidin-4-yl)-3-(3-fluoro-adamantan-1-yl)-urea | CHEMBL1668923
Type:
Small organic molecule
Emp. Form.:
C18H27F2N3O2
Mol. Mass.:
355.4227
SMILES:
CC(=O)N1CCC(CC1)NC(=O)NC12CC3CC(F)(CC(F)(C3)C1)C2
: