Target
Lactoylglutathione lyase
Ligand
BDBM50336260
Substrate
Meas. Tech.
ChEMBL_716548 (CHEMBL1670272)
Ki
109000±n/a nM
Citation
 Yuan, MLuo, MSong, YXu, QWang, XCao, YBu, XRen, YHu, X Identification of curcumin derivatives as human glyoxalase I inhibitors: A combination of biological evaluation, molecular docking, 3D-QSAR and molecular dynamics simulation studies. Bioorg Med Chem 19:1189-96 (2011)  
Target
Name:
Lactoylglutathione lyase
Synonyms:
Aldoketomutase Glx I Glyoxalase I LGUL_HUMAN S-D-lactoylglutathione methylglyoxal lyase
Type:
Enzyme
Mol. Mass.:
20772.95
Organism:
Homo sapiens (Human)
Description:
Q04760
Residue:
184
  
Inhibitor
Name:
BDBM50336260
Synonyms:
4-(hydroxymethylene)-1,7-bis(4-methoxyphenyl)hepta-1,6-diene-3,5-dione | CHEMBL1669731
Type:
Small organic molecule
Emp. Form.:
C22H20O5
Mol. Mass.:
364.3912
SMILES:
COc1ccc(C=CC(=O)C(C=O)C(=O)C=Cc2ccc(OC)cc2)cc1
: